{"text_format":"1","workbook":"xlsx","n_sheets":6,"sheets":["Inputs","Table","Table Reader","Table Reader (2)","STL Volume","Sheet1"],"not_rendered":{"charts":0,"images":3,"macros":1,"external_links":0,"defined_names":0,"comments":0,"pivot_tables":0},"unopened":[],"bounds":{"document_bytes":16777216,"sheet_cells":100000,"rows_first":2000,"rows_last":500,"rows_between":2000,"halvings":0,"cell_chars":16384,"cell_head_chars":4096},"cells_cut":0,"cells_raw":0,"read":"whole","date_system":"1900"}

{"sheet":"Inputs","index":0,"n_rows":52,"n_cols":3,"rows_kept":52,"cut":false,"hidden":false,"merged":[[45,0,46,0]]}
["Existing e",3.8,"Percent"]
["Required e",7,"Percent"]
["Curve Length",348.48,"feet"]
["Required STL",null,"feet"]
["Existing STL",null,"feet"]
["Radius",933,"feet"]
["Width",24,"feet"]
["Density",111,"Lbs / Sq Yd - inch"]
{"$rows_left_out":45}
{"sheet":"Table","index":1,"n_rows":36,"n_cols":34,"rows_kept":36,"cut":false,"hidden":false,"merged":[]}
[null,2,null,null," LANE"]
[null," e",null,null," DESIGN"]
[null," (%)",0," mph",15," mph",20," mph",25," mph",30," mph",35," mph",40," mph",45," mph",50," mph",55," mph",60," mph",65," mph",70," mph",75," mph",80," mph",85," mph"]
[null," R","Radius","STL","Radius","STL","Radius","STL","Radius","STL","Radius","STL","Radius","STL","Radius","STL","Radius","STL","Radius","STL","Radius","STL","Radius","STL","Radius","STL","Radius","STL","Radius","STL","Radius","STL","Radius","STL"]
[null,"NC",0,0,932,0,1640,0,2370,0,3240,0,4260,0,5410,0,6710,0,8150,0,9720,0,11500,0,12900,0,14500,0,16100,0,17800,0,999999,0]
[null,"RC",0,70,676,70,1190,70,1720,70,2370,80,3120,80,3970,90,4930,90,5990,100,7150,110,8440,110,9510,120,10700,120,12000,130,13300,140,999999,140]
[null,2.2000000000000002,0,70,605,70,1070,70,1550,80,2130,80,2800,90,3570,90,4440,100,5400,110,6450,110,7620,120,8600,120,9660,130,10800,140,12000,150,999999,150]
[null,2.4,0,80,546,80,959,80,1400,80,1930,90,2540,90,3240,100,4030,100,4910,110,5870,120,6930,120,7830,130,8810,140,9850,140,11000,160,999999,160]
{"$rows_left_out":29}
{"sheet":"Table Reader","index":2,"n_rows":40,"n_cols":34,"rows_kept":40,"cut":false,"hidden":false,"merged":[]}
[]
[]
[]
[]
[{"$f":"AND(B5,NOT(B6))","v":false},{"$f":"0<=Inputs!B$1","v":true},{"$f":"Table!C5<=Inputs!$B$6","v":true},{"$f":"IF(AND($A5,C5,NOT(E5)),Table!D5,0)","v":0},{"$f":"Table!E5<=Inputs!$B$6","v":true},{"$f":"IF(AND($A5,E5,NOT(G5)),Table!F5,0)","v":0},{"$f":"Table!G5<=Inputs!$B$6","v":false},{"$f":"IF(AND($A5,G5,NOT(I5)),Table!H5,0)","v":0},{"$f":"Table!I5<=Inputs!$B$6","v":false},{"$f":"IF(AND($A5,I5,NOT(K5)),Table!J5,0)","v":0},{"$f":"Table!K5<=Inputs!$B$6","v":false},{"$f":"IF(AND($A5,K5,NOT(M5)),Table!L5,0)","v":0},{"$f":"Table!M5<=Inputs!$B$6","v":false},{"$f":"IF(AND($A5,M5,NOT(O5)),Table!N5,0)","v":0},{"$f":"Table!O5<=Inputs!$B$6","v":false},{"$f":"IF(AND($A5,O5,NOT(Q5)),Table!P5,0)","v":0},{"$f":"Table!Q5<=Inputs!$B$6","v":false},{"$f":"IF(AND($A5,Q5,NOT(S5)),Table!R5,0)","v":0},{"$f":"Table!S5<=Inputs!$B$6","v":false},{"$f":"IF(AND($A5,S5,NOT(U5)),Table!T5,0)","v":0},{"$f":"Table!U5<=Inputs!$B$6","v":false},{"$f":"IF(AND($A5,U5,NOT(W5)),Table!V5,0)","v":0},{"$f":"Table!W5<=Inputs!$B$6","v":false},{"$f":"IF(AND($A5,W5,NOT(Y5)),Table!X5,0)","v":0},{"$f":"Table!Y5<=Inputs!$B$6","v":false},{"$f":"IF(AND($A5,Y5,NOT(AA5)),Table!Z5,0)","v":0},{"$f":"Table!AA5<=Inputs!$B$6","v":false},{"$f":"IF(AND($A5,AA5,NOT(AC5)),Table!AB5,0)","v":0},{"$f":"Table!AC5<=Inputs!$B$6","v":false},{"$f":"IF(AND($A5,AC5,NOT(AE5)),Table!AD5,0)","v":0},{"$f":"Table!AE5<=Inputs!$B$6","v":false},{"$f":"IF(AND($A5,AE5,NOT(AG5)),Table!AF5,0)","v":0},{"$f":"Table!AG5<=Inputs!$B$6","v":false},{"$f":"IF(AND($A5,AG5,NOT(AI5)),Table!AH5,0)","v":0}]
[{"$f":"AND(B6,NOT(B7))","v":false},{"$f":"2<=Inputs!B$1","v":true},{"$f":"Table!C6<=Inputs!$B$6","v":true},{"$f":"IF(AND($A6,C6,NOT(E6)),Table!D6,0)","v":0},{"$f":"Table!E6<=Inputs!$B$6","v":true},{"$f":"IF(AND($A6,E6,NOT(G6)),Table!F6,0)","v":0},{"$f":"Table!G6<=Inputs!$B$6","v":false},{"$f":"IF(AND($A6,G6,NOT(I6)),Table!H6,0)","v":0},{"$f":"Table!I6<=Inputs!$B$6","v":false},{"$f":"IF(AND($A6,I6,NOT(K6)),Table!J6,0)","v":0},{"$f":"Table!K6<=Inputs!$B$6","v":false},{"$f":"IF(AND($A6,K6,NOT(M6)),Table!L6,0)","v":0},{"$f":"Table!M6<=Inputs!$B$6","v":false},{"$f":"IF(AND($A6,M6,NOT(O6)),Table!N6,0)","v":0},{"$f":"Table!O6<=Inputs!$B$6","v":false},{"$f":"IF(AND($A6,O6,NOT(Q6)),Table!P6,0)","v":0},{"$f":"Table!Q6<=Inputs!$B$6","v":false},{"$f":"IF(AND($A6,Q6,NOT(S6)),Table!R6,0)","v":0},{"$f":"Table!S6<=Inputs!$B$6","v":false},{"$f":"IF(AND($A6,S6,NOT(U6)),Table!T6,0)","v":0},{"$f":"Table!U6<=Inputs!$B$6","v":false},{"$f":"IF(AND($A6,U6,NOT(W6)),Table!V6,0)","v":0},{"$f":"Table!W6<=Inputs!$B$6","v":false},{"$f":"IF(AND($A6,W6,NOT(Y6)),Table!X6,0)","v":0},{"$f":"Table!Y6<=Inputs!$B$6","v":false},{"$f":"IF(AND($A6,Y6,NOT(AA6)),Table!Z6,0)","v":0},{"$f":"Table!AA6<=Inputs!$B$6","v":false},{"$f":"IF(AND($A6,AA6,NOT(AC6)),Table!AB6,0)","v":0},{"$f":"Table!AC6<=Inputs!$B$6","v":false},{"$f":"IF(AND($A6,AC6,NOT(AE6)),Table!AD6,0)","v":0},{"$f":"Table!AE6<=Inputs!$B$6","v":false},{"$f":"IF(AND($A6,AE6,NOT(AG6)),Table!AF6,0)","v":0},{"$f":"Table!AG6<=Inputs!$B$6","v":false},{"$f":"IF(AND($A6,AG6,NOT(AI6)),Table!AH6,0)","v":0}]
[{"$f":"AND(B7,NOT(B8))","v":false},{"$f":"Table!B7<=Inputs!B$1","v":true},{"$f":"Table!C7<=Inputs!$B$6","v":true},{"$f":"IF(AND($A7,C7,NOT(E7)),Table!D7,0)","v":0},{"$f":"Table!E7<=Inputs!$B$6","v":true},{"$f":"IF(AND($A7,E7,NOT(G7)),Table!F7,0)","v":0},{"$f":"Table!G7<=Inputs!$B$6","v":false},{"$f":"IF(AND($A7,G7,NOT(I7)),Table!H7,0)","v":0},{"$f":"Table!I7<=Inputs!$B$6","v":false},{"$f":"IF(AND($A7,I7,NOT(K7)),Table!J7,0)","v":0},{"$f":"Table!K7<=Inputs!$B$6","v":false},{"$f":"IF(AND($A7,K7,NOT(M7)),Table!L7,0)","v":0},{"$f":"Table!M7<=Inputs!$B$6","v":false},{"$f":"IF(AND($A7,M7,NOT(O7)),Table!N7,0)","v":0},{"$f":"Table!O7<=Inputs!$B$6","v":false},{"$f":"IF(AND($A7,O7,NOT(Q7)),Table!P7,0)","v":0},{"$f":"Table!Q7<=Inputs!$B$6","v":false},{"$f":"IF(AND($A7,Q7,NOT(S7)),Table!R7,0)","v":0},{"$f":"Table!S7<=Inputs!$B$6","v":false},{"$f":"IF(AND($A7,S7,NOT(U7)),Table!T7,0)","v":0},{"$f":"Table!U7<=Inputs!$B$6","v":false},{"$f":"IF(AND($A7,U7,NOT(W7)),Table!V7,0)","v":0},{"$f":"Table!W7<=Inputs!$B$6","v":false},{"$f":"IF(AND($A7,W7,NOT(Y7)),Table!X7,0)","v":0},{"$f":"Table!Y7<=Inputs!$B$6","v":false},{"$f":"IF(AND($A7,Y7,NOT(AA7)),Table!Z7,0)","v":0},{"$f":"Table!AA7<=Inputs!$B$6","v":false},{"$f":"IF(AND($A7,AA7,NOT(AC7)),Table!AB7,0)","v":0},{"$f":"Table!AC7<=Inputs!$B$6","v":false},{"$f":"IF(AND($A7,AC7,NOT(AE7)),Table!AD7,0)","v":0},{"$f":"Table!AE7<=Inputs!$B$6","v":false},{"$f":"IF(AND($A7,AE7,NOT(AG7)),Table!AF7,0)","v":0},{"$f":"Table!AG7<=Inputs!$B$6","v":false},{"$f":"IF(AND($A7,AG7,NOT(AI7)),Table!AH7,0)","v":0}]
[{"$f":"AND(B8,NOT(B9))","v":false},{"$f":"Table!B8<=Inputs!B$1","v":true},{"$f":"Table!C8<=Inputs!$B$6","v":true},{"$f":"IF(AND($A8,C8,NOT(E8)),Table!D8,0)","v":0},{"$f":"Table!E8<=Inputs!$B$6","v":true},{"$f":"IF(AND($A8,E8,NOT(G8)),Table!F8,0)","v":0},{"$f":"Table!G8<=Inputs!$B$6","v":false},{"$f":"IF(AND($A8,G8,NOT(I8)),Table!H8,0)","v":0},{"$f":"Table!I8<=Inputs!$B$6","v":false},{"$f":"IF(AND($A8,I8,NOT(K8)),Table!J8,0)","v":0},{"$f":"Table!K8<=Inputs!$B$6","v":false},{"$f":"IF(AND($A8,K8,NOT(M8)),Table!L8,0)","v":0},{"$f":"Table!M8<=Inputs!$B$6","v":false},{"$f":"IF(AND($A8,M8,NOT(O8)),Table!N8,0)","v":0},{"$f":"Table!O8<=Inputs!$B$6","v":false},{"$f":"IF(AND($A8,O8,NOT(Q8)),Table!P8,0)","v":0},{"$f":"Table!Q8<=Inputs!$B$6","v":false},{"$f":"IF(AND($A8,Q8,NOT(S8)),Table!R8,0)","v":0},{"$f":"Table!S8<=Inputs!$B$6","v":false},{"$f":"IF(AND($A8,S8,NOT(U8)),Table!T8,0)","v":0},{"$f":"Table!U8<=Inputs!$B$6","v":false},{"$f":"IF(AND($A8,U8,NOT(W8)),Table!V8,0)","v":0},{"$f":"Table!W8<=Inputs!$B$6","v":false},{"$f":"IF(AND($A8,W8,NOT(Y8)),Table!X8,0)","v":0},{"$f":"Table!Y8<=Inputs!$B$6","v":false},{"$f":"IF(AND($A8,Y8,NOT(AA8)),Table!Z8,0)","v":0},{"$f":"Table!AA8<=Inputs!$B$6","v":false},{"$f":"IF(AND($A8,AA8,NOT(AC8)),Table!AB8,0)","v":0},{"$f":"Table!AC8<=Inputs!$B$6","v":false},{"$f":"IF(AND($A8,AC8,NOT(AE8)),Table!AD8,0)","v":0},{"$f":"Table!AE8<=Inputs!$B$6","v":false},{"$f":"IF(AND($A8,AE8,NOT(AG8)),Table!AF8,0)","v":0},{"$f":"Table!AG8<=Inputs!$B$6","v":false},{"$f":"IF(AND($A8,AG8,NOT(AI8)),Table!AH8,0)","v":0}]
{"$rows_left_out":33}
{"sheet":"Table Reader (2)","index":3,"n_rows":40,"n_cols":34,"rows_kept":40,"cut":false,"hidden":false,"merged":[]}
[]
[]
[]
[]
[{"$f":"AND(B5,NOT(B6))","v":false},{"$f":"0<=Inputs!B$2","v":true},{"$f":"Table!C5<=Inputs!$B$6","v":true},{"$f":"IF(AND(A5,AH5+AF5+AD5+AB5+Z5+X5+V5+T5+R5+P5+N5+L5+J5+H5+F5=0),Table!D5,0)","v":0},{"$f":"Table!E5<=Inputs!$B$6","v":true},{"$f":"IF(AND($A5,C5,NOT(E5)),Table!F5,0)","v":0},{"$f":"Table!G5<=Inputs!$B$6","v":false},{"$f":"IF(AND($A5,E5,NOT(G5)),Table!H5,0)","v":0},{"$f":"Table!I5<=Inputs!$B$6","v":false},{"$f":"IF(AND($A5,G5,NOT(I5)),Table!J5,0)","v":0},{"$f":"Table!K5<=Inputs!$B$6","v":false},{"$f":"IF(AND($A5,I5,NOT(K5)),Table!L5,0)","v":0},{"$f":"Table!M5<=Inputs!$B$6","v":false},{"$f":"IF(AND($A5,K5,NOT(M5)),Table!N5,0)","v":0},{"$f":"Table!O5<=Inputs!$B$6","v":false},{"$f":"IF(AND($A5,M5,NOT(O5)),Table!P5,0)","v":0},{"$f":"Table!Q5<=Inputs!$B$6","v":false},{"$f":"IF(AND($A5,O5,NOT(Q5)),Table!R5,0)","v":0},{"$f":"Table!S5<=Inputs!$B$6","v":false},{"$f":"IF(AND($A5,Q5,NOT(S5)),Table!T5,0)","v":0},{"$f":"Table!U5<=Inputs!$B$6","v":false},{"$f":"IF(AND($A5,S5,NOT(U5)),Table!V5,0)","v":0},{"$f":"Table!W5<=Inputs!$B$6","v":false},{"$f":"IF(AND($A5,U5,NOT(W5)),Table!X5,0)","v":0},{"$f":"Table!Y5<=Inputs!$B$6","v":false},{"$f":"IF(AND($A5,W5,NOT(Y5)),Table!Z5,0)","v":0},{"$f":"Table!AA5<=Inputs!$B$6","v":false},{"$f":"IF(AND($A5,Y5,NOT(AA5)),Table!AB5,0)","v":0},{"$f":"Table!AC5<=Inputs!$B$6","v":false},{"$f":"IF(AND($A5,AA5,NOT(AC5)),Table!AD5,0)","v":0},{"$f":"Table!AE5<=Inputs!$B$6","v":false},{"$f":"IF(AND($A5,AC5,NOT(AE5)),Table!AF5,0)","v":0},{"$f":"Table!AG5<=Inputs!$B$6","v":false},{"$f":"IF(AND($A5,AE5,NOT(AG5)),Table!AH5,0)","v":0}]
[{"$f":"AND(B6,NOT(B7))","v":false},{"$f":"2<=Inputs!B$2","v":true},{"$f":"Table!C6<=Inputs!$B$6","v":true},{"$f":"IF(AND(A6,AH6+AF6+AD6+AB6+Z6+X6+V6+T6+R6+P6+N6+L6+J6+H6+F6=0),Table!D6,0)","v":0},{"$f":"Table!E6<=Inputs!$B$6","v":true},{"$f":"IF(AND($A6,C6,NOT(E6)),Table!F6,0)","v":0},{"$f":"Table!G6<=Inputs!$B$6","v":false},{"$f":"IF(AND($A6,E6,NOT(G6)),Table!H6,0)","v":0},{"$f":"Table!I6<=Inputs!$B$6","v":false},{"$f":"IF(AND($A6,G6,NOT(I6)),Table!J6,0)","v":0},{"$f":"Table!K6<=Inputs!$B$6","v":false},{"$f":"IF(AND($A6,I6,NOT(K6)),Table!L6,0)","v":0},{"$f":"Table!M6<=Inputs!$B$6","v":false},{"$f":"IF(AND($A6,K6,NOT(M6)),Table!N6,0)","v":0},{"$f":"Table!O6<=Inputs!$B$6","v":false},{"$f":"IF(AND($A6,M6,NOT(O6)),Table!P6,0)","v":0},{"$f":"Table!Q6<=Inputs!$B$6","v":false},{"$f":"IF(AND($A6,O6,NOT(Q6)),Table!R6,0)","v":0},{"$f":"Table!S6<=Inputs!$B$6","v":false},{"$f":"IF(AND($A6,Q6,NOT(S6)),Table!T6,0)","v":0},{"$f":"Table!U6<=Inputs!$B$6","v":false},{"$f":"IF(AND($A6,S6,NOT(U6)),Table!V6,0)","v":0},{"$f":"Table!W6<=Inputs!$B$6","v":false},{"$f":"IF(AND($A6,U6,NOT(W6)),Table!X6,0)","v":0},{"$f":"Table!Y6<=Inputs!$B$6","v":false},{"$f":"IF(AND($A6,W6,NOT(Y6)),Table!Z6,0)","v":0},{"$f":"Table!AA6<=Inputs!$B$6","v":false},{"$f":"IF(AND($A6,Y6,NOT(AA6)),Table!AB6,0)","v":0},{"$f":"Table!AC6<=Inputs!$B$6","v":false},{"$f":"IF(AND($A6,AA6,NOT(AC6)),Table!AD6,0)","v":0},{"$f":"Table!AE6<=Inputs!$B$6","v":false},{"$f":"IF(AND($A6,AC6,NOT(AE6)),Table!AF6,0)","v":0},{"$f":"Table!AG6<=Inputs!$B$6","v":false},{"$f":"IF(AND($A6,AE6,NOT(AG6)),Table!AH6,0)","v":0}]
[{"$f":"AND(B7,NOT(B8))","v":false},{"$f":"Table!B7<=Inputs!B$2","v":true},{"$f":"Table!C7<=Inputs!$B$6","v":true},{"$f":"IF(AND(A7,AH7+AF7+AD7+AB7+Z7+X7+V7+T7+R7+P7+N7+L7+J7+H7+F7=0),Table!D7,0)","v":0},{"$f":"Table!E7<=Inputs!$B$6","v":true},{"$f":"IF(AND($A7,C7,NOT(E7)),Table!F7,0)","v":0},{"$f":"Table!G7<=Inputs!$B$6","v":false},{"$f":"IF(AND($A7,E7,NOT(G7)),Table!H7,0)","v":0},{"$f":"Table!I7<=Inputs!$B$6","v":false},{"$f":"IF(AND($A7,G7,NOT(I7)),Table!J7,0)","v":0},{"$f":"Table!K7<=Inputs!$B$6","v":false},{"$f":"IF(AND($A7,I7,NOT(K7)),Table!L7,0)","v":0},{"$f":"Table!M7<=Inputs!$B$6","v":false},{"$f":"IF(AND($A7,K7,NOT(M7)),Table!N7,0)","v":0},{"$f":"Table!O7<=Inputs!$B$6","v":false},{"$f":"IF(AND($A7,M7,NOT(O7)),Table!P7,0)","v":0},{"$f":"Table!Q7<=Inputs!$B$6","v":false},{"$f":"IF(AND($A7,O7,NOT(Q7)),Table!R7,0)","v":0},{"$f":"Table!S7<=Inputs!$B$6","v":false},{"$f":"IF(AND($A7,Q7,NOT(S7)),Table!T7,0)","v":0},{"$f":"Table!U7<=Inputs!$B$6","v":false},{"$f":"IF(AND($A7,S7,NOT(U7)),Table!V7,0)","v":0},{"$f":"Table!W7<=Inputs!$B$6","v":false},{"$f":"IF(AND($A7,U7,NOT(W7)),Table!X7,0)","v":0},{"$f":"Table!Y7<=Inputs!$B$6","v":false},{"$f":"IF(AND($A7,W7,NOT(Y7)),Table!Z7,0)","v":0},{"$f":"Table!AA7<=Inputs!$B$6","v":false},{"$f":"IF(AND($A7,Y7,NOT(AA7)),Table!AB7,0)","v":0},{"$f":"Table!AC7<=Inputs!$B$6","v":false},{"$f":"IF(AND($A7,AA7,NOT(AC7)),Table!AD7,0)","v":0},{"$f":"Table!AE7<=Inputs!$B$6","v":false},{"$f":"IF(AND($A7,AC7,NOT(AE7)),Table!AF7,0)","v":0},{"$f":"Table!AG7<=Inputs!$B$6","v":false},{"$f":"IF(AND($A7,AE7,NOT(AG7)),Table!AH7,0)","v":0}]
[{"$f":"AND(B8,NOT(B9))","v":false},{"$f":"Table!B8<=Inputs!B$2","v":true},{"$f":"Table!C8<=Inputs!$B$6","v":true},{"$f":"IF(AND(A8,AH8+AF8+AD8+AB8+Z8+X8+V8+T8+R8+P8+N8+L8+J8+H8+F8=0),Table!D8,0)","v":0},{"$f":"Table!E8<=Inputs!$B$6","v":true},{"$f":"IF(AND($A8,C8,NOT(E8)),Table!F8,0)","v":0},{"$f":"Table!G8<=Inputs!$B$6","v":false},{"$f":"IF(AND($A8,E8,NOT(G8)),Table!H8,0)","v":0},{"$f":"Table!I8<=Inputs!$B$6","v":false},{"$f":"IF(AND($A8,G8,NOT(I8)),Table!J8,0)","v":0},{"$f":"Table!K8<=Inputs!$B$6","v":false},{"$f":"IF(AND($A8,I8,NOT(K8)),Table!L8,0)","v":0},{"$f":"Table!M8<=Inputs!$B$6","v":false},{"$f":"IF(AND($A8,K8,NOT(M8)),Table!N8,0)","v":0},{"$f":"Table!O8<=Inputs!$B$6","v":false},{"$f":"IF(AND($A8,M8,NOT(O8)),Table!P8,0)","v":0},{"$f":"Table!Q8<=Inputs!$B$6","v":false},{"$f":"IF(AND($A8,O8,NOT(Q8)),Table!R8,0)","v":0},{"$f":"Table!S8<=Inputs!$B$6","v":false},{"$f":"IF(AND($A8,Q8,NOT(S8)),Table!T8,0)","v":0},{"$f":"Table!U8<=Inputs!$B$6","v":false},{"$f":"IF(AND($A8,S8,NOT(U8)),Table!V8,0)","v":0},{"$f":"Table!W8<=Inputs!$B$6","v":false},{"$f":"IF(AND($A8,U8,NOT(W8)),Table!X8,0)","v":0},{"$f":"Table!Y8<=Inputs!$B$6","v":false},{"$f":"IF(AND($A8,W8,NOT(Y8)),Table!Z8,0)","v":0},{"$f":"Table!AA8<=Inputs!$B$6","v":false},{"$f":"IF(AND($A8,Y8,NOT(AA8)),Table!AB8,0)","v":0},{"$f":"Table!AC8<=Inputs!$B$6","v":false},{"$f":"IF(AND($A8,AA8,NOT(AC8)),Table!AD8,0)","v":0},{"$f":"Table!AE8<=Inputs!$B$6","v":false},{"$f":"IF(AND($A8,AC8,NOT(AE8)),Table!AF8,0)","v":0},{"$f":"Table!AG8<=Inputs!$B$6","v":false},{"$f":"IF(AND($A8,AE8,NOT(AG8)),Table!AH8,0)","v":0}]
{"$rows_left_out":33}
{"sheet":"STL Volume","index":4,"n_rows":107,"n_cols":27,"rows_kept":107,"cut":false,"hidden":false,"merged":[]}
["0 = Curve",null,null,0,"W/2","W",null,null,null,null,null,0,"W/2","W",null,null,0,"W/2","W",null,"Avg dh","Avg dh",null,"Avg Area","Avg Area"]
[null,null,"x","hex(x)","hm(x)","he(x)",null,"Slope R","Slope L",null,"x","hreq(w,x)","hreq(w,x)","hreq(w,x)",null,"x","dh(w,x)","dh(w,x)","dh(w,x)",null,"Left","Right",null,"Left","Right",null,"Area"]
[0,null,{"$f":"A3/100*C$103","v":0},0,{"$f":"IF(AVERAGE(D3,F3)<0.24,0.24,AVERAGE(D3,F3))","v":0.45599999999999996},{"$f":"Inputs!B1/100*Inputs!B7","v":0.91199999999999992},null,{"$f":"E3/12*100","v":3.8},{"$f":"(F3-E3)/12*100","v":3.8},null,{"$f":"C3","v":0},{"$f":"IF(K3>50,0,(1-K3/50)/12)","v":8.3333333333333329E-2},{"$f":"IF(AVERAGE(L3,N3)<0.24,0.24,AVERAGE(L3,N3))","v":0.92333333333333323},{"$f":"Inputs!B2*Inputs!B7/100+L3","v":1.7633333333333332},null,{"$f":"K3","v":0},{"$f":"L3-D3","v":8.3333333333333329E-2},{"$f":"M3-E3","v":0.46733333333333327},{"$f":"N3-F3","v":0.85133333333333328},null,{"$f":"AVERAGE(Q3:R3)","v":0.27533333333333332},{"$f":"AVERAGE(R3:S3)","v":0.65933333333333333},null,{"$f":"Inputs!$B$7/2*U3","v":3.3039999999999998},{"$f":"Inputs!$B$7/2*V3","v":7.9119999999999999},null,{"$f":"X3+Y3","v":11.215999999999999}]
[{"$f":"1","v":1},null,{"$f":"A4/100*C$103","v":2.2000000000000002},0,{"$f":"IF(AVERAGE(D4,F4)<0.24,0.24,AVERAGE(D4,F4))","v":0.44596799999999998},{"$f":"IF(C4<A$106,F$3*(1-C4/A$106),0)","v":0.89193599999999995},null,{"$f":"E4/12*100","v":3.7163999999999997},{"$f":"(F4-E4)/12*100","v":3.7163999999999997},null,{"$f":"C4","v":2.2000000000000002},{"$f":"IF(K4>50,0,(1-K4/50)/12)","v":7.9666666666666663E-2},{"$f":"IF(AVERAGE(L4,N4)<0.24,0.24,AVERAGE(L4,N4))","v":0.91268333333333329},{"$f":"N$3*(1-K4/C$103)","v":1.7456999999999998},null,{"$f":"K4","v":2.2000000000000002},{"$f":"L4-D4","v":7.9666666666666663E-2},0.46671533333333332,0.85376399999999986,null,{"$f":"AVERAGE(Q4:R4)","v":0.27319099999999996},0.66023966666666656,null,{"$f":"Inputs!$B$7/2*U4","v":3.2782919999999995},{"$f":"Inputs!$B$7/2*V4","v":7.9228759999999987},null,{"$f":"X4+Y4","v":11.201167999999999}]
[{"$f":"A4+1","v":2},null,{"$f":"A5/100*C$103","v":4.4000000000000004},0,0.43593599999999993,{"$f":"IF(C5<A$106,F$3*(1-C5/A$106),0)","v":0.87187199999999987},null,3.6327999999999991,3.6327999999999991,null,4.4000000000000004,{"$f":"IF(K5>50,0,(1-K5/50)/12)","v":7.5999999999999998E-2},{"$f":"IF(AVERAGE(L5,N5)<0.24,0.24,AVERAGE(L5,N5))","v":0.90203333333333324},{"$f":"N$3*(1-K5/C$103)","v":1.7280666666666664},null,4.4000000000000004,7.5999999999999998E-2,0.46609733333333331,0.85619466666666655,null,0.27104866666666666,0.6611459999999999,null,{"$f":"Inputs!$B$7/2*U5","v":3.2525839999999997},{"$f":"Inputs!$B$7/2*V5","v":7.9337519999999984},null,11.186335999999997]
[3,null,{"$f":"A6/100*C$103","v":6.6},0,0.42590399999999995,0.8518079999999999,null,3.5491999999999995,3.5491999999999995,null,6.6,7.2333333333333333E-2,0.89138333333333331,1.7104333333333333,null,6.6,7.2333333333333333E-2,0.46547933333333336,0.85862533333333335,null,0.26890633333333336,0.66205233333333335,null,{"$f":"Inputs!$B$7/2*U6","v":3.2268760000000003},{"$f":"Inputs!$B$7/2*V6","v":7.9446279999999998},null,11.171504000000001]
[4,null,8.8000000000000007,0,0.41587199999999996,0.83174399999999993,null,3.4655999999999998,3.4655999999999998,null,8.8000000000000007,6.8666666666666668E-2,0.88073333333333326,1.6927999999999999,null,8.8000000000000007,6.8666666666666668E-2,0.46486133333333329,0.86105599999999993,null,0.266764,0.66295866666666659,null,{"$f":"Inputs!$B$7/2*U7","v":3.201168},{"$f":"Inputs!$B$7/2*V7","v":7.9555039999999995},null,11.156672]
[5,null,11,0,0.40583999999999998,0.81167999999999996,null,3.3819999999999997,3.3819999999999997,null,11,6.5000000000000002E-2,0.87008333333333321,1.6751666666666665,null,11,6.5000000000000002E-2,0.46424333333333323,0.86348666666666651,null,0.26462166666666664,0.66386499999999993,null,{"$f":"Inputs!$B$7/2*U8","v":3.1754599999999997},{"$f":"Inputs!$B$7/2*V8","v":7.9663799999999991},null,11.141839999999998]
{"$rows_left_out":100}
{"sheet":"Sheet1","index":5,"n_rows":0,"n_cols":0,"rows_kept":0,"cut":false,"hidden":false,"merged":[]}